我有一些测试数据,想为每个项目创建一个单元测试。我的第一个想法是这样做的:
import unittest
l = [["foo", "a", "a",], ["bar", "a", "b"], ["lee", "b", "b"]]
class TestSequence(unittest.TestCase):
def testsample(self):
for name, a,b in l:
print "test", name
self.assertEqual(a,b)
if __name__ == '__main__':
unittest.main()
这样做的缺点是它在一个测试中处理所有数据。我想在飞行中为每个项目生成一个测试。有什么建议吗?
load_tests是2.7中引入的一种鲜为人知的机制,用于动态创建TestSuite。有了它,您可以轻松地创建参数化测试。
例如:
import unittest
class GeneralTestCase(unittest.TestCase):
def __init__(self, methodName, param1=None, param2=None):
super(GeneralTestCase, self).__init__(methodName)
self.param1 = param1
self.param2 = param2
def runTest(self):
pass # Test that depends on param 1 and 2.
def load_tests(loader, tests, pattern):
test_cases = unittest.TestSuite()
for p1, p2 in [(1, 2), (3, 4)]:
test_cases.addTest(GeneralTestCase('runTest', p1, p2))
return test_cases
该代码将运行load_tests返回的测试套件中的所有测试用例。发现机制不会自动运行其他测试。
或者,您也可以使用此票据所示的继承:http://bugs.python.org/msg151444
使用unittest(从3.4开始)
从Python 3.4开始,标准库unittest包具有subTest上下文管理器。
参见文档:
26.4.7. 使用子测试区分测试迭代
分测验
例子:
from unittest import TestCase
param_list = [('a', 'a'), ('a', 'b'), ('b', 'b')]
class TestDemonstrateSubtest(TestCase):
def test_works_as_expected(self):
for p1, p2 in param_list:
with self.subTest():
self.assertEqual(p1, p2)
你也可以给subTest()指定一个自定义消息和参数值:
with self.subTest(msg="Checking if p1 equals p2", p1=p1, p2=p2):
用鼻子
鼻测试框架支持这一点。
示例(下面的代码是包含测试的文件的全部内容):
param_list = [('a', 'a'), ('a', 'b'), ('b', 'b')]
def test_generator():
for params in param_list:
yield check_em, params[0], params[1]
def check_em(a, b):
assert a == b
nosetests命令输出信息如下:
> nosetests -v
testgen.test_generator('a', 'a') ... ok
testgen.test_generator('a', 'b') ... FAIL
testgen.test_generator('b', 'b') ... ok
======================================================================
FAIL: testgen.test_generator('a', 'b')
----------------------------------------------------------------------
Traceback (most recent call last):
File "/usr/lib/python2.5/site-packages/nose-0.10.1-py2.5.egg/nose/case.py", line 203, in runTest
self.test(*self.arg)
File "testgen.py", line 7, in check_em
assert a == b
AssertionError
----------------------------------------------------------------------
Ran 3 tests in 0.006s
FAILED (failures=1)
您可以使用TestSuite和自定义TestCase类。
import unittest
class CustomTest(unittest.TestCase):
def __init__(self, name, a, b):
super().__init__()
self.name = name
self.a = a
self.b = b
def runTest(self):
print("test", self.name)
self.assertEqual(self.a, self.b)
if __name__ == '__main__':
suite = unittest.TestSuite()
suite.addTest(CustomTest("Foo", 1337, 1337))
suite.addTest(CustomTest("Bar", 0xDEAD, 0xC0DE))
unittest.TextTestRunner().run(suite)
这可以使用元类优雅地解决:
import unittest
l = [["foo", "a", "a",], ["bar", "a", "b"], ["lee", "b", "b"]]
class TestSequenceMeta(type):
def __new__(mcs, name, bases, dict):
def gen_test(a, b):
def test(self):
self.assertEqual(a, b)
return test
for tname, a, b in l:
test_name = "test_%s" % tname
dict[test_name] = gen_test(a,b)
return type.__new__(mcs, name, bases, dict)
class TestSequence(unittest.TestCase):
__metaclass__ = TestSequenceMeta
if __name__ == '__main__':
unittest.main()
只使用元类,如这里所示;
class DocTestMeta(type):
"""
Test functions are generated in metaclass due to the way some
test loaders work. For example, setupClass() won't get called
unless there are other existing test methods, and will also
prevent unit test loader logic being called before the test
methods have been defined.
"""
def __init__(self, name, bases, attrs):
super(DocTestMeta, self).__init__(name, bases, attrs)
def __new__(cls, name, bases, attrs):
def func(self):
"""Inner test method goes here"""
self.assertTrue(1)
func.__name__ = 'test_sample'
attrs[func.__name__] = func
return super(DocTestMeta, cls).__new__(cls, name, bases, attrs)
class ExampleTestCase(TestCase):
"""Our example test case, with no methods defined"""
__metaclass__ = DocTestMeta
输出:
test_sample (ExampleTestCase) ... OK