我有一个Node.js应用托管在Heroku。每次我做一个git push heroku,我得到以下错误:

Counting objects: 14, done.
Delta compression using up to 6 threads.
Compressing objects: 100% (12/12), done.
Writing objects: 100% (12/12), 1.20 KiB, done.
Total 12 (delta 8), reused 0 (delta 0)

-----> Node.js app detected
-----> Resolving engine versions
       Using Node.js version: 0.6.20
       Using npm version: 1.2.12
-----> Fetching Node.js binaries
-----> Vendoring node into slug
-----> Installing dependencies with npm
       npm http GET https://registry.npmjs.org/pg/0.6.15
       npm http GET https://registry.npmjs.org/socket.io
       npm http 200 https://registry.npmjs.org/pg/0.6.15
       npm http GET https://registry.npmjs.org/pg/-/pg-0.6.15.tgz
       npm http 200 https://registry.npmjs.org/socket.io
       npm http GET https://registry.npmjs.org/socket.io/-/socket.io-0.9.13.tgz
       npm http 200 https://registry.npmjs.org/pg/-/pg-0.6.15.tgz
       npm http 200 https://registry.npmjs.org/socket.io/-/socket.io-0.9.13.tgz
       npm http GET https://registry.npmjs.org/socket.io-client/0.9.11
       npm http GET https://registry.npmjs.org/policyfile/0.0.4
       npm http GET https://registry.npmjs.org/base64id/0.1.0
       npm http GET https://registry.npmjs.org/redis/0.7.3
       npm http GET https://registry.npmjs.org/generic-pool/1.0.9
       npm http 200 https://registry.npmjs.org/policyfile/0.0.4
       npm http GET https://registry.npmjs.org/policyfile/-/policyfile-0.0.4.tgz

       npm http 200 https://registry.npmjs.org/base64id/0.1.0
       npm http GET https://registry.npmjs.org/base64id/-/base64id-0.1.0.tgz
       npm http 200 https://registry.npmjs.org/generic-pool/1.0.9
       npm http GET https://registry.npmjs.org/generic-pool/-/generic-pool-1.0.9
.tgz
       npm http 200 https://registry.npmjs.org/socket.io-client/0.9.11
       npm http GET https://registry.npmjs.org/socket.io-client/-/socket.io-clie
nt-0.9.11.tgz
       npm http 200 https://registry.npmjs.org/redis/0.7.3
       npm http GET https://registry.npmjs.org/redis/-/redis-0.7.3.tgz
       npm http 200 https://registry.npmjs.org/policyfile/-/policyfile-0.0.4.tgz

       npm http 200 https://registry.npmjs.org/base64id/-/base64id-0.1.0.tgz
       npm http 200 https://registry.npmjs.org/generic-pool/-/generic-pool-1.0.9
.tgz
       npm http 200 https://registry.npmjs.org/socket.io-client/-/socket.io-clie
nt-0.9.11.tgz
       npm http 200 https://registry.npmjs.org/redis/-/redis-0.7.3.tgz

       > pg@0.6.15 install /tmp/build_36us8733h7kkr/node_modules/pg
       > node-waf configure build || (exit 0)

       Checking for program g++ or c++          : /usr/bin/g++
       Checking for program cpp                 : /usr/bin/cpp
       Checking for program ar                  : /usr/bin/ar
       Checking for program ranlib              : /usr/bin/ranlib
       Checking for g++                         : ok
       Checking for node path                   : not found
       Checking for node prefix                 : ok /tmp/node-node-nNUw
       Checking for program pg_config           : /usr/bin/pg_config
       'configure' finished successfully (0.058s)
       Waf: Entering directory `/tmp/build_36us8733h7kkr/node_modules/pg/build'
       [1/2] cxx: src/binding.cc -> build/Release/src/binding_1.o
       [2/2] cxx_link: build/Release/src/binding_1.o -> build/Release/binding.no
de
       Waf: Leaving directory `/tmp/build_36us8733h7kkr/node_modules/pg/build'
       'build' finished successfully (0.492s)
       npm http GET https://registry.npmjs.org/uglify-js/1.2.5
       npm http GET https://registry.npmjs.org/ws
       npm http GET https://registry.npmjs.org/xmlhttprequest/1.4.2
       npm http GET https://registry.npmjs.org/active-x-obfuscator/0.0.1
       npm http 200 https://registry.npmjs.org/active-x-obfuscator/0.0.1
       npm http GET https://registry.npmjs.org/active-x-obfuscator/-/active-x-ob
fuscator-0.0.1.tgz
       npm http 200 https://registry.npmjs.org/uglify-js/1.2.5
       npm http GET https://registry.npmjs.org/uglify-js/-/uglify-js-1.2.5.tgz
       npm http 200 https://registry.npmjs.org/xmlhttprequest/1.4.2
       npm http GET https://registry.npmjs.org/xmlhttprequest/-/xmlhttprequest-1
.4.2.tgz
       npm http 200 https://registry.npmjs.org/ws
       npm http GET https://registry.npmjs.org/ws/-/ws-0.4.25.tgz
       npm http 200 https://registry.npmjs.org/active-x-obfuscator/-/active-x-ob
fuscator-0.0.1.tgz
       npm http 200 https://registry.npmjs.org/uglify-js/-/uglify-js-1.2.5.tgz
       npm http 200 https://registry.npmjs.org/xmlhttprequest/-/xmlhttprequest-1
.4.2.tgz
       npm http 200 https://registry.npmjs.org/ws/-/ws-0.4.25.tgz
       npm http GET https://registry.npmjs.org/zeparser/0.0.5
       npm http GET https://registry.npmjs.org/commander
       npm http GET https://registry.npmjs.org/tinycolor
       npm http GET https://registry.npmjs.org/options
       npm http 200 https://registry.npmjs.org/zeparser/0.0.5
       npm http GET https://registry.npmjs.org/zeparser/-/zeparser-0.0.5.tgz
       npm http 200 https://registry.npmjs.org/options
       npm http GET https://registry.npmjs.org/options/-/options-0.0.3.tgz
       npm http 200 https://registry.npmjs.org/tinycolor
       npm http GET https://registry.npmjs.org/tinycolor/-/tinycolor-0.0.1.tgz
       npm http 200 https://registry.npmjs.org/commander
       npm http GET https://registry.npmjs.org/commander/-/commander-0.6.1.tgz
       npm http 200 https://registry.npmjs.org/zeparser/-/zeparser-0.0.5.tgz
       npm http 200 https://registry.npmjs.org/options/-/options-0.0.3.tgz
       npm http 200 https://registry.npmjs.org/tinycolor/-/tinycolor-0.0.1.tgz
       npm http 200 https://registry.npmjs.org/commander/-/commander-0.6.1.tgz

       > ws@0.4.25 install /tmp/build_36us8733h7kkr/node_modules/socket.io/node_
modules/socket.io-client/node_modules/ws
       > (node-gyp rebuild 2> builderror.log) || (exit 0)

       make: Entering directory `/tmp/build_36us8733h7kkr/node_modules/socket.io
/node_modules/socket.io-client/node_modules/ws/build'
         CXX(target) Release/obj.target/bufferutil/src/bufferutil.o
         SOLINK_MODULE(target) Release/obj.target/bufferutil.node
         SOLINK_MODULE(target) Release/obj.target/bufferutil.node: Finished
         COPY Release/bufferutil.node
         CXX(target) Release/obj.target/validation/src/validation.o
         SOLINK_MODULE(target) Release/obj.target/validation.node
         SOLINK_MODULE(target) Release/obj.target/validation.node: Finished
         COPY Release/validation.node
       make: Leaving directory `/tmp/build_36us8733h7kkr/node_modules/socket.io/
node_modules/socket.io-client/node_modules/ws/build'
       npm ERR! cb() never called!
       npm ERR! not ok code undefined
       npm ERR! cb() never called!
       npm ERR! not ok code 1
 !     Failed to install --production dependencies with npm
 !     Heroku push rejected, failed to compile Node.js app

To git@heroku.com:still-chamber-1286.git
 ! [remote rejected] master -> master (pre-receive hook declined)
error: failed to push some refs to 'git@heroku.com:still-chamber-1286.git'

错误在最后几行:

npm ERR! cb() never called!
           npm ERR! not ok code undefined
           npm ERR! cb() never called!
           npm ERR! not ok code 1
     !     Failed to install --production dependencies with npm
     !     Heroku push rejected, failed to compile Node.js app

    To git@heroku.com:still-chamber-1286.git
     ! [remote rejected] master -> master (pre-receive hook declined)
    error: failed to push some refs to 'git@heroku.com:still-chamber-1286.git'

我以前把我的代码推送给Heroku没有任何问题;从星期一开始,我才出现这个错误。

我在网上看到过类似的帖子,提到的错误略有不同,但还没有看到一个![远程拒绝]master -> master(预接收钩子拒绝)之前。


当前回答

原来我不在太空里了!删除驱动器上的文件可以正常启动和运行。

其他回答

我试着

NPM缓存验证 NPM缓存清理——force。 I -g NPM

但运气不好。

但是卸载以前的节点版本并安装最新的节点版本对我来说是可行的。

brew uninstall node
cd /usr/local
git checkout f7bbdcc /usr/local/Library/Formula/node.rb
brew install node

找到其他版本如下:

brew versions node

安装NPM会导致:

npm ERR! cb() never called!

npm ERR! This is an error with npm itself. Please report this error at:
npm ERR!     <https://github.com/npm/npm/issues>

在我的例子中,当我升级到Node.js 8.11.1版本时,这个错误开始发生。之前使用Node.js 6.12版本。x和NPM 5.8.0版本。

除此之外,我的测试脚本找不到AVA:

sh: ava: command not found
npm ERR! Test failed.  See above for more details.

解决方案是将NPM降级至5.7.1

我发现了几个其他问题,这导致我,两个代理相关。

I use a local proxy to forward to our corporate proxy. My local proxy was running on port 3128. I happened to see while watching the process / listening port list that a different process would start, try to bind to port 3128, then stop. When this happened my local proxy lost its state and quit accepting connections, even though it still had the port bound. In this case I reconfigured my local proxy to listen on port 3129 instead, which removed the port conflict with the other process. Somewhat similar to above - my local proxy process, just for whatever other reason, would die and leave the port open. I had to kill the process / free the port / reboot and restart my local proxy to get things back.

我们在Azure pipeline上有同样的错误,但在我们的本地机器上没有。不幸的是,这个错误并没有告诉我太多的原因,但是,下面是我们的解决方案:

在npm ci命令之前添加'npmAuthenticate'-task。

参见此处的任务描述